{"text_format":"1","workbook":"xlsx","n_sheets":3,"sheets":["Claim Form - Antifreeze","RCF RI Premium Details","Active RCFs"],"not_rendered":{"charts":0,"images":2,"macros":0,"external_links":0,"defined_names":3,"comments":0,"pivot_tables":0},"unopened":[],"bounds":{"document_bytes":16777216,"sheet_cells":100000,"rows_first":2000,"rows_last":500,"rows_between":2000,"halvings":0,"cell_chars":16384,"cell_head_chars":4096},"cells_cut":0,"cells_raw":0,"read":"whole","date_system":"1900"}

{"sheet":"Claim Form - Antifreeze","index":0,"n_rows":65,"n_cols":13,"rows_kept":65,"cut":false,"hidden":false,"merged":[[32,4,32,7],[33,4,33,7],[35,4,35,9],[52,1,52,9],[53,1,53,9],[30,1,30,7],[3,2,3,6],[6,2,6,6],[5,2,5,6],[64,2,64,8],[60,2,60,5],[61,2,61,5],[60,6,60,9],[61,6,61,9],[59,2,59,5],[59,6,59,9],[58,1,58,9],[55,1,55,9],[56,1,56,9],[54,1,54,9],[51,1,51,9],[1,1,1,9],[2,1,2,9],[7,2,7,9],[9,1,9,9],[4,2,4,9],[3,8,3,9],[5,8,5,9],[6,8,6,9]]}
[]
[null,"Used Antifreeze\nProcessor Return Incentive Claim Form"]
[null,"All Blue Sections Must Be Completed"]
[null,"Processor Name",null,null,null,null,null,"Claim/Invoice #"]
[null,"Mailing Address"]
[null,"City and Province",null,null,null,null,null,"Postal Code"]
[null,"Phone ",null,null,null,null,null,"GST #"]
[null,"Registration #"]
[]
[null,"All Volumes must be reported in Litres (L)"]
[null,"Collector Name","Date Received \nat Processor","Reference #","Zone","Gross\nVolume","Glycol\n Test %","Adjusted\nVolume","Zone Rate","Amount Claimed by Processor"]
[null,null,null,null,null,null,null,null,{"$f":"IF($E12=\"\",\"-\",VLOOKUP($E12,$E$38:$I$47,5,FALSE))","v":"-"},{"$f":"IF(I12=\"-\",\"-\",H12*I12)","v":"-"},null,null,{"$f":"F12*(1-G12)","v":0}]
[null,null,null,null,null,null,null,null,"-",{"$f":"IF(I13=\"-\",\"-\",H13*I13)","v":"-"},null,null,{"$f":"F13*(1-G13)","v":0}]
[null,null,null,null,null,null,null,null,"-","-",null,null,{"$f":"F14*(1-G14)","v":0}]
[null,null,null,null,null,null,null,null,"-","-",null,null,{"$f":"F15*(1-G15)","v":0}]
[null,null,null,null,null,null,null,null,"-","-",null,null,0]
[null,null,null,null,null,null,null,null,"-","-",null,null,0]
[null,null,null,null,null,null,null,null,"-","-",null,null,0]
[null,null,null,null,null,null,null,null,"-","-",null,null,0]
[null,null,null,null,null,null,null,null,"-","-",null,null,0]
[null,null,null,null,null,null,null,null,"-","-",null,null,0]
[null,null,null,null,null,null,null,null,"-","-",null,null,0]
[null,null,null,null,null,null,null,null,"-","-",null,null,0]
[null,null,null,null,null,null,null,null,"-","-",null,null,0]
[null,null,null,null,null,null,null,null,"-","-",null,null,0]
[null,null,null,null,null,null,null,null,"-","-",null,null,0]
[null,null,null,null,null,null,null,null,"-","-",null,null,0]
[null,null,null,null,null,null,null,null,"-","-",null,null,0]
[null,null,null,null,null,null,null,null,null,0,null,null,0]
[null,null,null,null,"Total",{"$f":"IF(SUM(F12:F29)=0,\"-\",SUM(F12:F29))","v":"-"},{"$f":"IF(F30=\"-\",\"-\",1-(M30/F30))","v":"-"},{"$f":"IF(SUM(H12:H29)=0,\"-\",SUM(H12:H29))","v":"-"},null,{"$f":"SUM(J12:J29)","v":0},null,null,{"$f":"SUM(M12:M29)","v":0}]
[null,"RCF - RI Premium",null,null,null,null,null,null,null,{"$f":"'RCF RI Premium Details'!$J$34","v":0}]
[null,null,null,null,null,null,null,null,"Sub-Total",{"$f":"SUM(J30:J31)","v":0}]
[null,null,null,null,null,null,null,null,"5% GST",{"$f":"ROUND(J32*5%,2)","v":0}]
[null,null,null,null,null,null,null,null,"TOTAL",{"$f":"J32+J33","v":0}]
[]
[null,null,null,null,"Summary"]
[null,null,null,null,{"$f":"E11","v":"Zone"},"Gross\nVolume","Glycol\n Test %","Adjusted\nVolume","Zone Rate","Amount Claimed by Processor"]
[null,null,null,null,1,{"$f":"SUMIF($E$12:$E$29,$E38,F$12:F$29)","v":0},{"$f":"IF(F38=0,\"-\",1-(M38/F38))","v":"-"},{"$f":"SUMIF($E$12:$E$29,$E38,H$12:H$29)","v":0},0.35,{"$f":"SUMIF($E$12:$E$29,$E38,J$12:J$29)","v":0},null,null,{"$f":"SUMIF($E$12:$E$29,$E38,M$12:M$29)","v":0}]
[null,null,null,null,2,{"$f":"SUMIF($E$12:$E$29,$E39,F$12:F$29)","v":0},{"$f":"IF(F39=0,\"-\",1-(M39/F39))","v":"-"},0,0.37,0,null,null,0]
[null,null,null,null,3,0,{"$f":"IF(F40=0,\"-\",1-(M40/F40))","v":"-"},0,0.42,0,null,null,0]
[null,null,null,null,4,0,"-",0,0.4,0,null,null,0]
[null,null,null,null,5,0,"-",0,0.44,0,null,null,0]
[null,null,null,null,6,0,"-",0,0.42,0,null,null,0]
[null,null,null,null,7,0,"-",0,0.46,0,null,null,0]
[null,null,null,null,8,0,"-",0,0.52,0,null,null,0]
[null,null,null,null,9,0,"-",0,0.7,0,null,null,0]
[null,null,null,null,"RI Premium",{"$f":"SUMIF($E$12:$E$29,$E47,F$12:F$29)","v":0},{"$f":"IF(F47=0,\"-\",1-(M47/F47))","v":"-"},0,null,{"$f":"+J31","v":0},null,null,0]
[null,null,null,null,"Total",{"$f":"SUM(F38:F47)","v":0},{"$f":"IF(F48=0,\"-\",1-(M48/F48))","v":"-"},{"$f":"SUM(H38:H47)","v":0},"Subtotal",{"$f":"SUM(J38:J47)","v":0},null,null,{"$f":"SUM(M38:M47)","v":0}]
[null,null,null,null,null,null,null,null,"5% GST",{"$f":"ROUND(J48*5%,2)","v":0}]
[null,null,null,null,null,null,null,null,"TOTAL",{"$f":"J48+J49","v":0}]
[]
[null,"Ensure that all Collector Zone Summary Forms are submitted."]
[null,"I certify that all of the information contained within this claim form is correct."]
[null,"I understand the information in this report is subject to Desk Reviews, Field Reviews, and Compliance Reviews."]
[null,"The detailed records which substantiate the information herein are available upon request."]
[null,"I certify that, to the best of my knowledge, the materials included in this claim form were generated within British Columbia. "]
[null,"I certify that, to the best of my knowledge, only eligible oil materials (as determined by Interchange from time to time) have been included in this claim form. "]
[null,"I certify that, to the best of my knowledge, all processed materials have been sold for use in approved end uses (as determined by interchange from time to time)."]
[null,"I further acknowledge that I have read, and agree to be bound by, the terms and conditions in the Interchange Recycling Manual for Registered Collectors and Processors."]
[null,null,"Full Name and Title",null,null,null,"Approval and Date"]
[null,"Prepared By"]
[null,"Approved By"]
[]
[null,"*Interchange Recycling is a trade name and trade mark of the British Columbia Used Oil Management Association."]
[null,"INT1501A-P","Interchange GST NO. 89254 4701 RT0001",null,null,null,null,null,null,"2023-06-09"]

{"sheet":"RCF RI Premium Details","index":1,"n_rows":37,"n_cols":15,"rows_kept":37,"cut":false,"hidden":false,"merged":[[8,3,8,9],[9,1,9,9],[1,1,1,9],[2,1,2,9],[3,2,3,9],[4,2,4,9],[5,2,5,6],[5,7,5,9],[6,2,6,9],[7,2,7,9]]}
[]
[null,"Used Antifreeze\nRCF Collection Details",null,null,null,null,null,null,null,null,null,null,null,0.1]
[null,"All Blue Sections Must Be Completed"]
[null,"Processor Name"]
[null,"Mailing Address"]
[null,"City and Province",null,null,null,null,null,"Postal Code: "]
[null,"Phone "]
[null,"Registration #"]
[]
[null,"All Volumes must be reported in Litres (L)"]
[null,"Collector \nName","Collector Zone\nSummary #","RCF Collection \nDocket #","Date of Collection (MM-DD-YY)","RCF Location Name\n(Select from the list)","Gross\nVolume","% of Product \nConsumer Drop Off","Adjusted\nVolume","RI Premium"]
[null,null,null,null,null,null,null,{"$f":"IFERROR(VLOOKUP(F12,'Active RCFs'!$B$2:$I$301,8,FALSE),\"\")","v":""},{"$f":"IF(G12=0,\"-\",G12*H12)","v":"-"},{"$f":"IF(OR(ISBLANK(G12),ISBLANK(H12)), \"\", G12*H12*$N$2)","v":""}]
[null,null,null,null,null,null,null,{"$f":"IFERROR(VLOOKUP(F13,'Active RCFs'!$B$2:$I$301,8,FALSE),\"\")","v":""},{"$f":"IF(G13=0,\"-\",G13*H13)","v":"-"},{"$f":"IF(OR(ISBLANK(G13),ISBLANK(H13)), \"\", G13*H13*$N$2)","v":""},null,null,null,null,{"$f":"IF(OR(ISBLANK(A2),ISBLANK(B2)), \"\", G12*H12)","v":""}]
[null,null,null,null,null,null,null,{"$f":"IFERROR(VLOOKUP(F14,'Active RCFs'!$B$2:$I$301,8,FALSE),\"\")","v":""},"-",""]
[null,null,null,null,null,null,null,{"$f":"IFERROR(VLOOKUP(F15,'Active RCFs'!$B$2:$I$301,8,FALSE),\"\")","v":""},"-",""]
[null,null,null,null,null,null,null,{"$f":"IFERROR(VLOOKUP(F16,'Active RCFs'!$B$2:$I$301,8,FALSE),\"\")","v":""},"-",""]
[null,null,null,null,null,null,null,{"$f":"IFERROR(VLOOKUP(F17,'Active RCFs'!$B$2:$I$301,8,FALSE),\"\")","v":""},"-",""]
[null,null,null,null,null,null,null,{"$f":"IFERROR(VLOOKUP(F18,'Active RCFs'!$B$2:$I$301,8,FALSE),\"\")","v":""},"-",""]
[null,null,null,null,null,null,null,{"$f":"IFERROR(VLOOKUP(F19,'Active RCFs'!$B$2:$I$301,8,FALSE),\"\")","v":""},{"$f":"IF(G19=0,\"-\",G19*H19)","v":"-"},{"$f":"IF(OR(ISBLANK(G19),ISBLANK(H19)), \"\", G19*H19*$N$2)","v":""}]
[null,null,null,null,null,null,null,{"$f":"IFERROR(VLOOKUP(F20,'Active RCFs'!$B$2:$I$301,8,FALSE),\"\")","v":""},"-",""]
[null,null,null,null,null,null,null,{"$f":"IFERROR(VLOOKUP(F21,'Active RCFs'!$B$2:$I$301,8,FALSE),\"\")","v":""},"-",""]
[null,null,null,null,null,null,null,{"$f":"IFERROR(VLOOKUP(F22,'Active RCFs'!$B$2:$I$301,8,FALSE),\"\")","v":""},"-",""]
[null,null,null,null,null,null,null,{"$f":"IFERROR(VLOOKUP(F23,'Active RCFs'!$B$2:$I$301,8,FALSE),\"\")","v":""},"-",""]
[null,null,null,null,null,null,null,{"$f":"IFERROR(VLOOKUP(F24,'Active RCFs'!$B$2:$I$301,8,FALSE),\"\")","v":""},"-",""]
[null,null,null,null,null,null,null,{"$f":"IFERROR(VLOOKUP(F25,'Active RCFs'!$B$2:$I$301,8,FALSE),\"\")","v":""},{"$f":"IF(G25=0,\"-\",G25*H25)","v":"-"},""]
[null,null,null,null,null,null,null,{"$f":"IFERROR(VLOOKUP(F26,'Active RCFs'!$B$2:$I$301,8,FALSE),\"\")","v":""},{"$f":"IF(G26=0,\"-\",G26*H26)","v":"-"},""]
[null,null,null,null,null,null,null,{"$f":"IFERROR(VLOOKUP(F27,'Active RCFs'!$B$2:$I$301,8,FALSE),\"\")","v":""},"-",""]
[null,null,null,null,null,null,null,{"$f":"IFERROR(VLOOKUP(F28,'Active RCFs'!$B$2:$I$301,8,FALSE),\"\")","v":""},"-",""]
[null,null,null,null,null,null,null,{"$f":"IFERROR(VLOOKUP(F29,'Active RCFs'!$B$2:$I$301,8,FALSE),\"\")","v":""},"-",""]
[null,null,null,null,null,"Sub Total",{"$f":"SUM(G12:G29)","v":0},null,{"$f":"SUM(I12:I29)","v":0},{"$f":"SUM(J12:J29)","v":0}]
[]
[]
[]
[null,null,null,null,null,null,{"$f":"SUM(G30:G33)","v":0},null,{"$f":"SUM(I30:I33)","v":0},{"$f":"SUM(J30:J33)","v":0}]
[null,"Bottom 3 lines in Purple are for entering summary details from the Collectors' Collector Zone Summary"]
[null,"Orange cells have formulas "]
[null,"*Interchange Recycling is a trade name and trade mark of the British Columbia Used Oil Management Association."]

{"sheet":"Active RCFs","index":2,"n_rows":288,"n_cols":9,"rows_kept":288,"cut":false,"hidden":false,"merged":[]}
["List of Active and Approved RCFs -- as of April 7, 2025"]
["Reg. No.","Business Name","Legal Name","Address","City","Postal Code","General Telephone Number","Business Type","RI Premium Rate (%)"]
["BC60229","150 M & S Tire & Service Ltd.","0801620 BC Ltd.","10 Settlers Place","150 Mile House","V0K 2G0","+1 250 296 4116","Auto Repair",0.5]
["BC60176","7 Mile Landfill and Recycling Center (RDMW)","Regional District of Mount Waddington","16 km West of Port McNeill on Highway 19","Port McNeill","V0N 2R0","+1 250 949 1681","Recycling Center",1]
["BC60143","70 Mile House Eco-Depot (TNRD)","Thompson-Nicola Regional District","3061 N Bonaparte Road","70 Mile House","V2C 2A9","+1 250 377 8673","Recycling Center",1]
["BC50042","Ace Automotive","Ace Automotive","4685 Dundalk Road S","Port Alberni","V9Y 8P2","+1 250 723 3130","Auto Repair",0.5]
["BC60022","Alberni Valley Landfill (ACRD)","Alberni-Clayoquot Regional District","7080 McCoy Lake Road","Port Alberni","V9Y 2E3","+1 250 723 1059","Landfill",1]
["BC60290","Alert Bay Transfer Station","The Corporation of the Village of Alert Bay","154 Alder Rd","Alert Bay","V0N 1A0","+1 250 974 7091","Transfer Station",1]
["BC60023","Arjun Esso","Arjun Services Ltd.","3210 Smith Drive","Armstrong","V0E 1B1","+1 250 546 3772","Auto Repair",0.5]
["BC50294","A-Star Automotive Recycling Ltd.","A-Star Automotive Recycling Ltd.","2782 Cessna Road","Prince George","V2N 2H8","+1 250 963 3211","Auto Repair",0.5]
["BC60262","Barry Beecroft Fuel Distributors Ltd.","Barry Beecroft Fuel Distributors Ltd","448 Industrial Ave E","Penticton","V2A 3J1","+1 250 490 0567","Bulk Dealer",1]
["BC60280","Big O Tires Westbank","1218674 BC Ltd.","2110-1920 Old Okanagan Hwy","Westbank","V4T 3K6","+1 250 769 5909","Auto Repair",0.5]
["BC60027","Bings Creek Recycling Centre (CWVRD)","Cowichan Valley Regional Disrict","3900 Drinkwater Road","Duncan","V9L 6P2","+1 250 746 2540","Recycling Center",1]
["BC60144","Blue River Eco-Depot (TNRD)","Thompson-Nicola Regional District","5889 Blueberry Road","Blue River","V0E 1J0","+1 250 377 8673","Recycling Center",1]
["BC60288","Boston Flats Eco Depot","Thompson-Nicola Regional District","1180 Campbell Hill Drive East","Cache Creek","V0K 0A5","+1 250 377 8673","Multi-Material Depot",1]
["BC60258","Bowen Island Municipality Recycling Depot","Bowen Island Municipality","1063 Mt Gardner Rd","Bowen Island","V0N 1G2","+1 604 947 2255","Recycling Center",1]
["BC60293","Bowser Automotive Ltd","Bowser Automotive","6970 Island Hwy W","Bowser","V0R 1G0","+1 250 757 8341","Auto Repair",0.5]
["BC60028","Brentwood Auto & Metal Recyclers","Brentwood Auto & Metal Recyclers","7481 West Saanich Road","Saanichton","V8M 1R7","+1 250 665 7282","Auto Repair",0.5]
["BC60253","Bridgeview Marine Ltd. - Delta","Bridgeview Marine Ltd.","6435 River Rd ","Delta","V4K 4E2","+1 604 946 8566","Retailer",0.75]
["BC60292","Bridgeview Marine Ltd. - Prince Rupert","Bridgeview Marine Ltd.","161 Metlakatla Rd","Prince Rupert"," V8J 1G0","+1 250 624 5809","Retailer",0.75]
["BC60029","Burns Lake Automotive Supply Ltd. (Burns Lake)","Burns Lake Automotive Supply Ltd.","98 Francois Lake Drive","Burns Lake","V0J 1E0","+1 250 692 7565","Retailer",0.75]
["BC60156","C M Klassen Holdings Inc.","C M Klassen Holdings Inc.","30586 Matsqui Place","Abbotsford","V2T 6L4","+1 604 850 5650","Bulk Dealer",1]
["BC60179","Campbell Mountain Landfill (RDOS)","Regional District of Okanagan Similkameen","1765 Reservoir Road","Penticton","V2A 8T3","+1 250 492 2907","Landfill",1]
["BC60108","Campbell River Waste Management Centre (CXRD)","Comox Valley Regional District","6700 Argonaut Road","Campbell River","V9W 1R7","+1 250 336 8083","Multi-Material Depot",1]
["BC60212","Canadian Tire #360 (Prince George)","Selen Anita Securities Inc.","5008 Domano Blvd","Prince George","V2N 4V8","+1 250 964 8258","Retailer",0.75]
["BC60091","Canadian Tire #363  (Fort St. John)","Bannerman Enterprises Inc.","Old Fort Rd","Fort St. John","V1J 0S6","+1 250 787 1142","Retailer",0.75]
["BC60092","Canadian Tire #466  (Duncan)","Bob Bridger Ent. Inc.","2929 Green Road","Duncan","V9L 0C1","+1 250 748 0161","Retailer",0.75]
["BC60162","Canadian Tire #488  (Port Alberni)","J.D. Weaver Holdings Ltd.","101-3550 Johnston Road","Port Alberni","V9Y 7W8","+1 250 720 0085","Retailer",0.75]
["BC50121","Canadian Tire 631 (Smithers)","Sabraw Enterprises Ltd. o/a","3221 Highway 16","Smithers","V0J 2N0","+1 250 847 3117","Retailer",0.75]
["BC60247","Caron Horsefly Service Ltd (Race Trac Gas)","Caron Horsefly Service Ltd","5753 Horsefly Road","Horsefly","V0L 1L0","+1 250 620 3447","Auto Repair",0.5]
["BC60052","Castle Fuels (2008) Inc. (100 Mile House)","Castle Fuels (2008) Inc.","380 Exeter Road","100 Mile House","V0K 2E0","+1 250 395 3818","Bulk Dealer",1]
["BC60123","Castle Fuels (2008) Inc. (Cranbrook)","Castle Fuels (2008) Inc.","1814 Theatre Road","Cranbrook","V1C 7G1","+1 250 426 6669","Bulk Dealer",1]
["BC60030","Castle Fuels (2008) Inc. (Golden)","Castle Fuels (2008) Inc.","820 10th Avenue N","Golden","V0A 1H0","+1 250 344 6161","Bulk Dealer",1]
["BC60031","Castle Fuels (2008) Inc. (Invermere)","Castle Fuels (2008) Inc","410 Panorama Drive","Invermere","V0A 1K7","+1 250 342 9915","Bulk Dealer",1]
["BC60054","Castle Fuels (2008) Inc. (Kamloops)","Castle Fuels (2008) Inc.","1639 Trans-Canada Highway East","Kamloops","V2C 3Z5","+1 250 372 5035","Bulk Dealer",1]
["BC60314","CASTLE FUELS (2008) INC. (Kelowna)","CASTLE FUELS (2008) INC.","275 Campion St","Kelowna","V1X 7S8","1 250 372 1383","Bulk Dealer",1]
["BC60053","Castle Fuels (2008) Inc. (Salmon Arm)","Castle Fuels (2008) Inc.","4941 46 Avenue SE","Salmon Arm","V1E 2W1","+1 250 832 3108","Bulk Dealer",1]
["BC60284","Central Surrey Recycling and Waste Centre","Greater Vancouver Sewerage & Drainage District","6711 154 St","Surrey","V3S 2B9","+1 604 432 6200","Recycling Center",1]
["BC50166","Chapman Motors Ltd.","Chapman Motors Ltd.","1040 Chapman Road","Cobble Hill","V0R 1L7","+1 250 743 3744","Car Dealer",0.5]
["BC50775","Chap's Auto Body","Chap's Auto Body (Brent Graham Ltd.)","655 North Mackenzie Ave","Williams Lake","V2G 1N9","+1 250 398 8116","Auto Repair",0.5]
["BC60308","Chetwynd Landfill (PRRD)","Peace River Regional District","3978 Blair Road","Chetwynd","V0C 1J0","+1 250 219 5776","Landfill",1]
["BC60001","Chilliwack Bottle Depot","Chilliwack Bottle Depot Ltd","2-45934 Tretheway Avenue","Chilliwack","V2P 1K5","+1 604 792 9572","Multi-Material Depot",1]
["BC50048","Chilliwack Ford Sales (1981) Ltd.","Chilliwack Ford Sales (1981) Ltd.","45681 Yale Road","Chilliwack","V2P 2N1","+1 604 792 1361","Car Dealer",0.5]
["BC50562","Christina Lake Mechanical Ltd.","Christina Lake Mechanical Ltd.","1600 Highway 3","Christina Lake","V0H 1E0","+1 250 447 6288","Auto Repair",0.5]
["BC60225","City of Burnaby Eco-Center","City of Burnaby","4855 Still Creek Drive","Burnaby","V5C 5V1","+1 604 294 7972","Recycling Center",1]
["BC60145","Clearwater Eco-Depot (TNRD)","Thompson-Nicola Regional District","290 Road 2A FSR","Clearwater","V0E 1N0","+1 250 377 8673","Recycling Center",1]
["BC60146","Clinton Eco-Depot (TNRD)","Thompson-Nicola Regional District","5 Boyd Pit Road","Clinton","V0K 1K0","+1 250 377 8673","Recycling Center",1]
["BC50580","Columbia Diesel Ltd.","Columbia Diesel Ltd.","911 11th Avenue North","Golden","V0A 1H0","+1 250 344 6647","Bulk Dealer",1]
["BC60034","Columbia Fuels (Ucluelet) / Eagle Marine","Parkland Fuel Corporation","1231 Eber Road","Ucluelet","V0R 3A0","+1 250 726 4262","Bulk Dealer",1]
["BC60195","Comox Valley Harbour Authority","Comox Valley Harbour Authority","121 Port Augusta Street","Comox","V8N 6H8","+1 250 339 6041","Recycling Center",1]
["BC60109","Comox Valley Waste Management Centre - Cumberland (CXRD)","Comox Valley Regional District","3699 Bevan Road","Cumberland","V0R 1S0","+1 250 336 8083","Multi-Material Depot",1]
["BC60198","Cortes Island Waste Management Center (CXRD)","Comox Strathcona Waste Management","1300 Squirrel Cove Road","Cortes Island","V0P 1K0","+1 250 935 6329","Multi-Material Depot",1]
["BC60215","Courtenay Kia","Courtenay Kia","1025A Comox Road","Courtenay","V9N 3P7","+1 250 334 9993","Car Dealer",0.5]
["BC60181","Cranbrook Depot (RDEK)","Regional District of East Kootenay","2405 22nd Street North","Cranbrook","V1C 7B1","+1 250 489 2768","Multi-Material Depot",1]
["BC60276","Cummings Road Regional Transfer Station","Cummings Road Regional Transfer Station","8375 Alpine Dr","Prince George","V2N 5W7","+1 250 960 4400","Transfer Station",1]
["BC60242","D.L. Recycling","D.L. Bins Ltd.","6844 Oldfield Road","Saanichton","V8M 2A2","+1 250 544 3103","Recycling Center",1]
["BC60252","Dalex Auto Services","Dalex Auto Services","4440 50 Ave N","Fort Nelson","V0C 1R0","+1 250 774 6804","Auto Repair",0.5]
["BC50549","Dave Landon Motors Ltd.","Dave Landon Motors Ltd.","7150 Market Street","Port Hardy","V0N 2P0","+1 250 949 6393","Car Dealer",0.5]
["BC60127","Dawn's Service","Dawn's Service","6584 Savona Access Road","Savona","V0K 2J0","+1 250 373 2458","Auto Repair",0.5]
["BC50694","Day Auto Electric","Day Auto Electric","8  Manitou Road","Fernie","V0B 1M5","+1 250 423 6422","Auto Repair",0.5]
["BC50230","Dearborn Motors Ltd.","Dearborn Motors Ltd.","2555 Trans-Canada Highway East","Kamloops","V2C 4B1","+1 250 372 7101","Car Dealer",0.5]
["BC60191","Denham Ford BC Ltd. (2018)","Denham Ford BC Ltd.","2417 Cranbrook Street North","Cranbrook","V1C 3T3","+1 800 663 3839","Car Dealer",0.5]
["BC60185","Denman Island Recycling Depot (CXRD)","Comox Regional District","5901 Denman Road","Denman Island","V0R 1T0","+1 250 218 0782","Recycling Center",1]
["BC50184","Derick's Automotive Services","Derick's Automotive Services","638 John Street","Victoria","V8T 1T9","+1 250 382 1314","Auto Repair",0.5]
["BC60117","Desert Cardlock Fuel Services Ltd (Williams Lake)","Desert Cardlock Fuel Services Ltd","25 Hodgson Road","Williams Lake","V2G 3P5","+1 250 392 4224","Bulk Dealer",1]
["BC60203","Discovery Harbour Authority","Discovery Harbour Authority","2355 Spit Road","Campbell River","V9W 6E3","+1 250 287 7091","Recycling Center",1]
["BC60011","District of Summerland Landfill","District of Summerland Landfill","17202 Bathville Road","Summerland","V0H 1Z0","+1 250 404 0431","Landfill",1]
["BC60278","District of Tumbler Ridge","District of Tumbler Ridge","103 Ridge Rd","Tumbler Ridge","V0C 2W0","+1 250 242 4242","Transfer Station",1]
["BC50551","E.J. Klassen GM Motorcade","E.J. Klassen GM Motorcade","9045 Granville Street","Port Hardy","V0N 2P0","+1 250 949 6393","Car Dealer",0.5]
["BC60285","Ehattesaht First Nation","Comox Valley Regional District of behalf of/ Ehattesaht First Nation","601 Mainline Rd","Zeballos","V0P 2A0","+1 250 761 4155","Multi-Material Depot",1]
["BC60266","Elkford Transfer Station - Inkaneep Rd","Regional District of East Kootenay","6 Inkaneep Rd","Elkford","V0B 1H0","+1 250 489 2791","Transfer Station",1]
["BC50660","Entire Automotive Services Ltd.","Entire Automotive Services Ltd.","180 3rd Avenue East","Prince Rupert","V8J 1K5","+1 250 627 8473","Auto Repair",0.5]
["BC60235","False Creek Fuels","False Creek Fuels Ltd.","1655 Whyte Avenue","Vancouver","V6J 1A9","+1 604 638 0020","Bulk Dealer",1]
["BC60202","False Creek Harbour Authority","False Creek Harbour Authority","1505 West 1st Avenue","Vancouver","V6J 1E8","+1 604 733 3625","Recycling Center",1]
["BC60301","Fernie Waste Transfer Station (RDEK)","Regional District of East Kootenav","6000 Highway 3","Fernie","V0B 1M0","250 423 6477","Transfer Station",1]
["BC60241","Fisher Road Recycling","D.L. Bins Ltd.","1355 Fisher Road","Cobble Hill","V0R 1L0","+1 250 733 2108","Recycling Center",1]
["BC60204","Fisherman's Harbour","Port Alberni Port Authority","3140 Harbour Road","Port Alberni","V9Y 4B9","+1 250 723 2533","Recycling Center",1]
["BC60037","Fleetwest Enterprises Ltd.","Fleetwest Enterprises Ltd.","126 Station Road","Clearwater","V0E 1N0","+1 250 674 3116","Retailer",0.75]
["BC60015","Foothills Boulevard Regional Landfill (FFGRD)","Regional District of Fraser-Fort George","6595 Foothills Boulevard","Prince George","V2M 6V8",12509604445,"Landfill",1]
["BC60129","Fort St John Co-op Association (Fort St John - 100 Ave)","Fort St John Co-operative Association","7315 100 Avenue","Fort St. John","V1J 5T8","+1 250 785 4471","Bulk Dealer",1]
{"$rows_left_out":208}